{"text_format":"1","workbook":"xlsx","n_sheets":4,"sheets":["Données","Match 01","Match 02","Match 03"],"not_rendered":{"charts":0,"images":0,"macros":0,"external_links":1,"defined_names":9,"comments":1,"pivot_tables":0},"unopened":[],"bounds":{"document_bytes":16777216,"sheet_cells":100000,"rows_first":2000,"rows_last":500,"rows_between":2000,"halvings":0,"cell_chars":16384,"cell_head_chars":4096},"cells_cut":0,"cells_raw":0,"read":"whole","date_system":"1900"}

{"sheet":"Données","index":0,"n_rows":518,"n_cols":11,"rows_kept":518,"cut":false,"hidden":true,"merged":[]}
["Division","Format","Equipes","Joueurs",null,"Index"]
[1,"2,60 m","ARGENCES (ABC)","ADNET FABRICE","017652Y",1]
[2,"2,80 m","ARGENTAN (PLA)","AHAMD ABDUZALIL","134671R",2]
[3,"3,10 m","BERNAY (BCB)","ALEXANDRE JACQUES","017869H",3]
[4,null,"CANY-BARVILLE (BCCB)","ALIA AHMED","166242Y",4]
[5,null,"CORMELLES (BCC)","ALLART ELYSE","113094U",5,1,"50 points","50 points","50 points","50 points"]
[null,null,"EVREUX (BCE)","ANDRE BERNARD","140477Z",null,2,"35 points","35 points","35 points","35 points"]
[null,null,"FECAMP (BCF)","ANTEM ANTOINE","017606E",null,3,"30 points","30 points","30 points","Pas de joueur n° 4"]
[null,null,"GAILLON (BCG)","ARGENTIN JEAN LUC","137351T",null,4,"25 points","25 points","25 points","Pas de joueur n° 4"]
[null,null,"LA SAUSSAYE (BCS)","ARRIVE JEAN LUC","100560S",null,5,"20 points\nou 60 reprises","20 points\nou 60 reprises","20 points\nou 60 reprises","Pas de joueur n° 4"]
[null,null,"LE HAVRE (CEHB)","AUBE ALAIN","168020F"]
[null,null,"LES ANDELYS (BCA)","AUBERT DANIEL","131880I"]
[null,null,"LISIEUX (BCL)","AUBERT JEAN PAUL","129110U"]
[null,null,"LOUVIERS (BACL)","AZIZIAN RICHARD","017803T"]
[null,null,"MAROMME (MBC)","BACHELET KARINE","171761X",null,null,"ARGENCES BILLARD CLUB             ","***","Place de la République","14370   ARGENCES"]
[null,null,"OISSEL (BCO)","BAERT PHILIPPE","172578K",null,null,"ASSOCIATION SPORTIVE STADE URVILLE","Le clos Moisson","325, allée des Avoineries","50460   URVILLE - NACQUEVILLE"]
[null,null,"PACY/EURE (BCP)","BAILLY NICOLAS","129095F",null,null,"BILLARD AMICAL CLUB LOVERIEN      ","***","3, rue Saint Jean","27400   LOUVIERS"]
[null,null,"ROUEN (RBC)","BAIS PHILIPPE","153013T",null,null,"BILLARD CLUB  DE CANY BARVILLE        ","Complexe sportif Sporticaux","Route de Veulettes","76450   CANY - BARVILLE"]
[null,null,"SAINT MARCEL (BCSM)","BARBIER JEAN LUC","017571V",null,null,"BILLARD CLUB ANDELYSIEN           ","***","3 et 5, rue Ste Clotilde","27700   LES ANDELYS"]
[null,null,"SAINT NICOLAS (BCSNA)","BASSIERE JEAN PIERRE","154338J",null,null,"BILLARD CLUB CORMELLOIS           ","Halle des Sports","rue de la Pagnolée","14123   CORMELLES LE ROYAL"]
[null,null,"SOTTEVILLE (BCS)","BATAILLE VINCENT","017754W",null,null,"BILLARD CLUB DE BERNAY      ","Gymnase Jacques Sébire","Chemin de la Couture","27300   BERNAY"]
[null,null,"URVILLE (ASSUN BC)","BATTE JEAN MARC","017531H",null,null,"BILLARD CLUB DE FECAMP            ","***","5, rue Henri Dunant","76400   FECAMP"]
[null,null,null,"BAUDER GILBERT","017689J",null,null,"BILLARD CLUB DE LA SAUSSAYE       ","Le Mille Club","rue Lesage  - Maille","27370   LA SAUSSAYE"]
[null,null,null,"BAVILLE SYLVAIN","152619Q",null,null,"BILLARD CLUB DE MAROMME","***","29, rue Berrube","76150   MAROMME"]
[null,null,null,"BAZAUD FRANCK","122758M",null,null,"BILLARD CLUB DE SAINT NICOLAS     ","***","93, rue Laurent Lefèbvre","76510   SAINT NICOLAS D'ALIERMONT"]
[null,null,null,"BEAUGRAND CHRISTIAN","161679N",null,null,"BILLARD CLUB DE SAINT-MARCEL      ","Espace Saint Exupéry","2, rue Jules Ferry","27950   SAINT MARCEL"]
[null,null,null,"BEAUVAIS JEAN FRANCOIS","140954I",null,null,"BILLARD CLUB EBROICIEN            ","Maison des Jeunes et de la Cullture","1, avenue Aristide Briand","27000   EVREUX"]
[null,null,null,"BEGUIN CLAUDE","150707M",null,null,"BILLARD CLUB GAILLONNAIS          ","Centre des Arts Contemporains","Allée de l'Ermitage","27600   GAILLON"]
[null,null,null,"BELDAME DANIEL","112270C",null,null,"BILLARD CLUB LEXOVIEN             ","Maison des Jeunes et de la Cullture","13, boulevard Louis Pasteur","14100   LISIEUX"]
[null,null,null,"BELINY GILLES","017706A",null,null,"BILLARD CLUB OSSELIEN             ","***","8, rue du manoir","76350   OISSEL"]
[null,null,null,"BENDJEMILA TOFIR","017734C",null,null,"BILLARD CLUB PACEEN               ","***","12, rue Montferrand","27120   PACY SUR EURE"]
[null,null,null,"BERTRAND MICHEL","142970W",null,null,"BILLARD CLUB SOTTEVILLAIS         ","***","123, rue Béranger","76300   SOTTEVILLE LES ROUEN"]
[null,null,null,"BESLIN DANIEL","172500A",null,null,"CLUB ECOLE HAVRAIS DE BILLARD     ","***","76, rue des Briquetiers","76600   LE HAVRE"]
[null,null,null,"BETON DOMINIQUE","017629B",null,null,"PATRONAGE LAIQUE ARGENTAN         ","Ecole Pierre Curie","Route de Urou","61200   ARGENTAN"]
[null,null,null,"BETON VALERIE","147263T",null,null,"ROUEN BILLARD CLUB                ","Espace de la Petite Bouverie","Allée Pierre de Coubertin","76100   ROUEN"]
[null,null,null,"BEZARD GEORGES","137339H"]
[null,null,null,"BEZNOSUC MARIE JOSE","169239F"]
[null,null,null,"BIANCHINI JEAN ROBERT","106781Z"]
[null,null,null,"BIDAULT ALAIN","160279R"]
[null,null,null,"BIENAIME ERIC","162881V"]
[null,null,null,"BIETTE CLAUDE","017497Z"]
[null,null,null,"BILLARD DAVID","017465T"]
[null,null,null,"BLIN ARMEL","169474L"]
[null,null,null,"BLONDEL JEAN THIERRY","144155L"]
[null,null,null,"BOCQUAIN JEAN PIERRE","112554A"]
[null,null,null,"BOGO JACQUES","138293Z"]
[null,null,null,"BOITARD MARC","136732Y"]
[null,null,null,"BONHOMME ERIC","144156M"]
[null,null,null,"BOTREL DAVID","156426D"]
[null,null,null,"BOUGOUIN JEAN MICHEL","149537Q"]
[null,null,null,"BOULIER ALAIN","152578W"]
[null,null,null,"BOURGET ALAIN","017466U"]
[null,null,null,"BOUTILLOT CHRISTIAN","163734X"]
[null,null,null,"BOUTIN GILLES","017457L"]
[null,null,null,"BOUTIN GUY","124623F"]
[null,null,null,"BOUTTIER JACKY","153690E"]
[null,null,null,"BOUVIER BERTRAND","149399Q"]
[null,null,null,"BOUVIER GUILLAUME","149400R"]
[null,null,null,"BOUXIN ERIC","167390W"]
[null,null,null,"BRAEMS FLORIAN","160931A"]
[null,null,null,"BREUGNON BERNARD","167321W"]
[null,null,null,"BROWANG CLAUDE","107038W"]
[null,null,null,"BROWANG ERIC","170924M"]
[null,null,null,"BROWANG JEROME","107039X"]
[null,null,null,"BROWANG MICHEL","107040Y"]
[null,null,null,"BRULARD DANIEL","017658E"]
[null,null,null,"BRUNET ANDRE","017746O"]
[null,null,null,"BUDIN BERNARD","163871W"]
[null,null,null,"BURGOT FRANCINE","169893R"]
[null,null,null,"BURGOT FRANCOIS","169892Q"]
[null,null,null,"BUSTOS MIGUEL ANGEL","171767D"]
[null,null,null,"BUTELET JEAN PAUL","017610I"]
[null,null,null,"CADINOT SEBASTIEN","158947T"]
[null,null,null,"CAJEAN PHILIPPE","010634A"]
[null,null,null,"CALLENS TIMEO","166291B"]
[null,null,null,"CARDON JEAN CLAUDE","017542S"]
[null,null,null,"CARLIER ALAIN","153754Z"]
[null,null,null,"CARPENTIER CHRISTIAN","135579P"]
[null,null,null,"CARPENTIER DIDIER","152654D"]
[null,null,null,"CARRE PIERRE","017467V"]
[null,null,null,"CAUWET NOEL","104533N"]
[null,null,null,"CAZAUX JEAN MARC","017643P"]
[null,null,null,"CAZEAUBON SERGE","167848T"]
[null,null,null,"CHAGNOT JEAN CLAUDE","017621T"]
[null,null,null,"CHALVET PATRICE","018027J"]
[null,null,null,"CHAMP FRANCOIS","159430T"]
[null,null,null,"CHANSON PIERRE","111053H"]
[null,null,null,"CHAPLEAU FRANCOIS","137817R"]
[null,null,null,"CHARBONNIER PHILIPPE","127340S"]
[null,null,null,"CHARRON EDITH","169334J"]
[null,null,null,"CHESNEAU JACQUES","133832K"]
[null,null,null,"CHESNEL MATHIEU","017896I"]
[null,null,null,"CHESNEL PATRICK","116629T"]
[null,null,null,"CHEVALIER PHILIPPE","126208E"]
[null,null,null,"CHEVON NOA","168778E"]
[null,null,null,"CHOLLET LIONEL","107240Q"]
[null,null,null,"CHOQUART PIERRE","133876C"]
[null,null,null,"CHOUPAUT BRUNO","151711D"]
[null,null,null,"CLEMENT FABRICE","152233W"]
[null,null,null,"COCHARD PATRICK","145961X"]
[null,null,null,"COCY GILLES","017709D"]
[null,null,null,"COLINET JEAN LUC","153098L"]
[null,null,null,"COLLE GREGORY","017823N"]
[null,null,null,"COLLE CONTE ILANE","172024H"]
[null,null,null,"COLLE CONTE LUDOVIC","172023G"]
[null,null,null,"COLLERY GABRIEL","172379T"]
[null,null,null,"COLOMER ALAIN","172501B"]
[null,null,null,"CORNO YVES","142307J"]
[null,null,null,"COTTEN JEAN PIERRE","017516S"]
[null,null,null,"COUCHOT BERNARD","112010C"]
[null,null,null,"COURTOIS PIERRE","168350P"]
[null,null,null,"CUVIER GILLES","120322U"]
[null,null,null,"CUVILLIEZ FRANCOISE","150560C"]
[null,null,null,"DAIGLE MICHEL","145242G"]
[null,null,null,"DAIREAUX SERGE","106824Q"]
[null,null,null,"DAON OLIVIER","169727L"]
[null,null,null,"DAUBEUF THIERRY","170708C"]
[null,null,null,"DAUSSY JEAN CLAUDE","148177M"]
[null,null,null,"DAUTRY ANNICK","106284W"]
[null,null,null,"DAVITTI CLAUDE","144074I"]
{"$rows_left_out":399}
{"sheet":"Match 01","index":1,"n_rows":25,"n_cols":14,"rows_kept":25,"cut":false,"hidden":false,"merged":[[25,0,25,13],[22,1,22,2],[22,3,22,5],[22,7,22,8],[22,9,22,11],[24,0,24,14],[5,0,9,1],[5,2,6,2],[5,3,6,3],[5,4,6,4],[5,5,6,6],[18,0,19,0],[10,2,10,3],[14,1,15,1],[16,1,17,1],[18,1,19,1],[18,3,19,3],[0,0,0,13],[4,4,4,6],[7,2,7,3],[7,4,7,7],[2,4,2,13],[2,0,3,1],[4,8,7,8],[4,10,4,13],[5,9,6,9],[16,3,17,3],[12,7,13,7],[14,0,15,0],[16,0,17,0],[12,0,13,0],[12,1,13,1],[12,3,13,3],[12,4,13,4],[12,5,13,5],[12,6,13,6],[14,3,15,3],[14,6,15,6],[14,7,15,7],[16,7,17,7],[18,7,19,7],[14,4,15,4],[14,5,15,5],[16,5,17,5],[16,6,17,6],[18,4,19,4],[18,5,19,5],[18,6,19,6],[12,10,13,10],[12,11,13,11],[12,12,13,12],[12,13,13,13],[16,9,17,9],[16,10,17,10],[16,11,17,11],[16,12,17,12],[18,9,19,9],[18,10,19,10],[18,11,19,11],[18,12,19,12],[18,13,19,13],[16,13,17,13],[5,10,5,13],[7,10,7,13],[6,10,6,13],[10,8,10,9],[9,4,9,6],[12,9,13,9],[14,12,15,12],[14,13,15,13],[16,4,17,4],[10,4,10,6],[9,10,9,12],[10,10,10,12],[14,9,15,9],[14,10,15,10],[14,11,15,11]]}
["CHAMPIONNAT DE FRANCE   -   3 BANDES   -   EQUIPES DE CLUB"]
[]
["Version : 07\ndu : 08/10/2020",null,"Match n° 2",null,"LIGUE DE NORMANDIE DE BILLARD   -   PHASE QUALIFICATIVE"]
[]
[null,null,"Match n° 3",null,"Division",null,null,null,"Lieu de l'épreuve","Club"]
["u",null,null,null,null,null,null,null,null,"n°, rue",{"$f":"IF(K5<>\"\",VLOOKUP(K5,Données!$H$15:$K$36,2,FALSE),\"\")","v":""}]
[null,null,null,null,null,null,null,null,null,null,{"$f":"IF(K5<>\"\",VLOOKUP(K5,Données!$H$15:$K$36,3,FALSE),\"\")","v":""}]
[null,null,"Rencontre du :",null,null,null,null,null,null,"Code   Ville",{"$f":"IF(K5<>\"\",VLOOKUP(K5,Données!$H$15:$K$36,4,FALSE),\"\")","v":""}]
[]
[null,null,null,null,"Nom du club",null,null,"N° équipe",null,null,"Nom du club",null,null,"N° équipe"]
[null,null,"Equipe recevante",null,null,null,null,null,"Equipe visiteuse"]
["Distance","Format du\nBillard","Nom   -   Prénom\nLicence","Points","Reprises","Série","Moyenne","Points de\nmatch","Nom   -   Prénom\nLicence","Points","Reprises","Série","Moyenne","Points de\nmatch"]
[{"$f":"IF(H5<>\"\",VLOOKUP($H$5,Données!$G$6:$K$10,2,FALSE),\"\")","v":""},null,null,null,null,null,{"$f":"IF(ISERROR(D13/E13),\"\",D13/E13)","v":""},{"$f":"IF(OR(G13=\"\",M13=\"\"),\"\",IF(D13>J13,2,IF(D13=J13,1,IF(D13<J13,0))))","v":""},null,null,{"$f":"IF(E13>0,E13,\"\")","v":""},null,{"$f":"IF(ISERROR(J13/K13),\"\",J13/K13)","v":""},{"$f":"IF(AND(H13<>\"\",J13<>\"\"),2-H13,\"\")","v":""}]
[null,null,{"$f":"IF(C13<>\"\",VLOOKUP(C13,licence,2,FALSE),\"\")","v":""},null,null,null,null,null,{"$f":"IF(I13<>\"\",VLOOKUP(I13,licence,2,FALSE),\"\")","v":""}]
[{"$f":"IF(H5<>\"\",VLOOKUP($H$5,Données!$G$6:$K$10,3,FALSE),\"\")","v":""},null,null,null,null,null,{"$f":"IF(ISERROR(D15/E15),\"\",D15/E15)","v":""},{"$f":"IF(OR(G15=\"\",M15=\"\"),\"\",IF(D15>J15,2,IF(D15=J15,1,IF(D15<J15,0))))","v":""},null,null,{"$f":"IF(E15>0,E15,\"\")","v":""},null,{"$f":"IF(ISERROR(J15/K15),\"\",J15/K15)","v":""},{"$f":"IF(AND(H15<>\"\",J15<>\"\"),2-H15,\"\")","v":""}]
[null,null,{"$f":"IF(C15<>\"\",VLOOKUP(C15,licence,2,FALSE),\"\")","v":""},null,null,null,null,null,{"$f":"IF(I15<>\"\",VLOOKUP(I15,licence,2,FALSE),\"\")","v":""}]
[{"$f":"IF(H5<>\"\",VLOOKUP($H$5,Données!$G$6:$K$10,4,FALSE),\"\")","v":""},null,null,null,null,null,{"$f":"IF(ISERROR(D17/E17),\"\",D17/E17)","v":""},{"$f":"IF(OR(G17=\"\",M17=\"\"),\"\",IF(D17>J17,2,IF(D17=J17,1,IF(D17<J17,0))))","v":""},null,null,{"$f":"IF(E17>0,E17,\"\")","v":""},null,{"$f":"IF(ISERROR(J17/K17),\"\",J17/K17)","v":""},{"$f":"IF(AND(H17<>\"\",J17<>\"\"),2-H17,\"\")","v":""}]
[null,null,{"$f":"IF(C17<>\"\",VLOOKUP(C17,licence,2,FALSE),\"\")","v":""},null,null,null,null,null,{"$f":"IF(I17<>\"\",VLOOKUP(I17,licence,2,FALSE),\"\")","v":""}]
[{"$f":"IF(H5<>\"\",VLOOKUP($H$5,Données!$G$6:$K$10,5,FALSE),\"\")","v":""},null,null,null,null,null,{"$f":"IF(ISERROR(D19/E19),\"\",D19/E19)","v":""},{"$f":"IF(OR(G19=\"\",M19=\"\"),\"\",IF(D19>J19,2,IF(D19=J19,1,IF(D19<J19,0))))","v":""},null,null,{"$f":"IF(E19>0,E19,\"\")","v":""},null,{"$f":"IF(ISERROR(J19/K19),\"\",J19/K19)","v":""},{"$f":"IF(AND(H19<>\"\",J19<>\"\"),2-H19,\"\")","v":""}]
[null,null,{"$f":"IF(C19<>\"\",VLOOKUP(C19,licence,2,FALSE),\"\")","v":""},null,null,null,null,null,{"$f":"IF(I19<>\"\",VLOOKUP(I19,licence,2,FALSE),\"\")","v":""}]
[null,null,"Totaux",{"$f":"SUM(D13:D20)","v":0},{"$f":"SUM(E13:E19)","v":0},null,null,{"$f":"SUM(H13:H19)","v":0},"Totaux",{"$f":"SUM(J13:J20)","v":0},{"$f":"SUM(K13:K19)","v":0},null,null,{"$f":"SUM(N13:N19)","v":0}]
[]
[null,"Signature du capitaine",null,null,null,null,null,"Signature du capitaine"]
[]
["Ces résultats sont à transmettre (sous 48 heures) à Philippe Lebourgeois mail :  lebourgeois.mp@gmail.com"]

{"sheet":"Match 02","index":2,"n_rows":25,"n_cols":14,"rows_kept":25,"cut":false,"hidden":false,"merged":[[24,0,24,14],[0,0,0,13],[4,4,4,6],[7,2,7,3],[7,4,7,7],[2,4,2,13],[3,0,9,1],[4,8,7,8],[4,10,4,13],[5,10,5,13],[7,10,7,13],[12,9,13,9],[12,10,13,10],[10,2,10,3],[10,8,10,9],[5,9,6,9],[6,10,6,13],[9,4,9,6],[10,4,10,6],[9,10,9,12],[10,10,10,12],[14,13,15,13],[14,0,15,0],[14,1,15,1],[14,3,15,3],[14,4,15,4],[14,5,15,5],[14,6,15,6],[14,7,15,7],[14,9,15,9],[12,13,13,13],[12,0,13,0],[12,1,13,1],[12,3,13,3],[12,4,13,4],[12,5,13,5],[12,11,13,11],[12,12,13,12],[12,6,13,6],[12,7,13,7],[14,11,15,11],[14,12,15,12],[16,9,17,9],[16,10,17,10],[16,11,17,11],[16,12,17,12],[14,10,15,10],[16,13,17,13],[16,0,17,0],[16,1,17,1],[16,3,17,3],[16,4,17,4],[16,5,17,5],[16,7,17,7],[16,6,17,6],[25,0,25,13],[18,7,19,7],[18,9,19,9],[18,10,19,10],[18,11,19,11],[18,12,19,12],[18,13,19,13],[22,9,22,11],[18,0,19,0],[18,1,19,1],[18,3,19,3],[22,1,22,2],[22,3,22,5],[22,7,22,8],[18,4,19,4],[18,5,19,5],[18,6,19,6]]}
["CHAMPIONNAT DE FRANCE   -   3 BANDES   -   EQUIPES DE CLUB"]
[]
[null,null,"Match n° 1",null,"LIGUE DE NORMANDIE DE BILLARD   -   PHASE QUALIFICATIVE"]
["v"]
[null,null,"Match n° 3",null,"Division",null,null,{"$f":"IF('Match 01'!H5<>\"\",'Match 01'!H5,\"\")","v":""},"Lieu de l'épreuve","Club",{"$f":"IF('Match 01'!K5<>\"\",'Match 01'!K5,\"\")","v":""}]
[null,null,null,null,null,null,null,null,null,"n°, rue",{"$f":"IF('Match 01'!K6<>\"\",'Match 01'!K6,\"\")","v":""}]
[null,null,null,null,null,null,null,null,null,null,{"$f":"IF('Match 01'!K7<>\"\",'Match 01'!K7,\"\")","v":""}]
[null,null,"Rencontre du :",null,{"$f":"IF('Match 01'!E8<>\"\",'Match 01'!E8,\"\")","v":""},null,null,null,null,"Code   Ville",{"$f":"IF('Match 01'!K8<>\"\",'Match 01'!K8,\"\")","v":""}]
[]
[null,null,null,null,"Nom du club",null,null,"N° équipe",null,null,"Nom du club",null,null,"N° équipe"]
[null,null,"Equipe recevante",null,null,null,null,null,"Equipe visiteuse"]
["Distance","Format du\nBillard","Nom   -   Prénom\nLicence","Points","Reprises","Série","Moyenne","Points de\nmatch","Nom   -   Prénom\nLicence","Points","Reprises","Série","Moyenne","Points de\nmatch"]
[{"$f":"IF(H5<>\"\",VLOOKUP($H$5,Données!$G$6:$K$10,2,FALSE),\"\")","v":""},null,null,null,null,null,{"$f":"IF(ISERROR(D13/E13),\"\",D13/E13)","v":""},{"$f":"IF(OR(G13=\"\",M13=\"\"),\"\",IF(D13>J13,2,IF(D13=J13,1,IF(D13<J13,0))))","v":""},null,null,{"$f":"IF(E13>0,E13,\"\")","v":""},null,{"$f":"IF(ISERROR(J13/K13),\"\",J13/K13)","v":""},{"$f":"IF(AND(H13<>\"\",J13<>\"\"),2-H13,\"\")","v":""}]
[null,null,{"$f":"IF(C13<>\"\",VLOOKUP(C13,licence,2,FALSE),\"\")","v":""},null,null,null,null,null,{"$f":"IF(I13<>\"\",VLOOKUP(I13,licence,2,FALSE),\"\")","v":""}]
[{"$f":"IF(H5<>\"\",VLOOKUP($H$5,Données!$G$6:$K$10,3,FALSE),\"\")","v":""},null,null,null,null,null,{"$f":"IF(ISERROR(D15/E15),\"\",D15/E15)","v":""},{"$f":"IF(OR(G15=\"\",M15=\"\"),\"\",IF(D15>J15,2,IF(D15=J15,1,IF(D15<J15,0))))","v":""},null,null,{"$f":"IF(E15>0,E15,\"\")","v":""},null,{"$f":"IF(ISERROR(J15/K15),\"\",J15/K15)","v":""},{"$f":"IF(AND(H15<>\"\",J15<>\"\"),2-H15,\"\")","v":""}]
[null,null,{"$f":"IF(C15<>\"\",VLOOKUP(C15,licence,2,FALSE),\"\")","v":""},null,null,null,null,null,{"$f":"IF(I15<>\"\",VLOOKUP(I15,licence,2,FALSE),\"\")","v":""}]
[{"$f":"IF(H5<>\"\",VLOOKUP($H$5,Données!$G$6:$K$10,4,FALSE),\"\")","v":""},null,null,null,null,null,{"$f":"IF(ISERROR(D17/E17),\"\",D17/E17)","v":""},{"$f":"IF(OR(G17=\"\",M17=\"\"),\"\",IF(D17>J17,2,IF(D17=J17,1,IF(D17<J17,0))))","v":""},null,null,{"$f":"IF(E17>0,E17,\"\")","v":""},null,{"$f":"IF(ISERROR(J17/K17),\"\",J17/K17)","v":""},{"$f":"IF(AND(H17<>\"\",J17<>\"\"),2-H17,\"\")","v":""}]
[null,null,{"$f":"IF(C17<>\"\",VLOOKUP(C17,licence,2,FALSE),\"\")","v":""},null,null,null,null,null,{"$f":"IF(I17<>\"\",VLOOKUP(I17,licence,2,FALSE),\"\")","v":""}]
[{"$f":"IF(H5<>\"\",VLOOKUP($H$5,Données!$G$6:$K$10,5,FALSE),\"\")","v":""},null,null,null,null,null,{"$f":"IF(ISERROR(D19/E19),\"\",D19/E19)","v":""},{"$f":"IF(OR(G19=\"\",M19=\"\"),\"\",IF(D19>J19,2,IF(D19=J19,1,IF(D19<J19,0))))","v":""},null,null,{"$f":"IF(E19>0,E19,\"\")","v":""},null,{"$f":"IF(ISERROR(J19/K19),\"\",J19/K19)","v":""},{"$f":"IF(AND(H19<>\"\",J19<>\"\"),2-H19,\"\")","v":""}]
[null,null,{"$f":"IF(C19<>\"\",VLOOKUP(C19,licence,2,FALSE),\"\")","v":""},null,null,null,null,null,{"$f":"IF(I19<>\"\",VLOOKUP(I19,licence,2,FALSE),\"\")","v":""}]
[null,null,"Totaux",{"$f":"SUM(D13:D20)","v":0},{"$f":"SUM(E13:E19)","v":0},null,null,{"$f":"SUM(H13:H19)","v":0},"Totaux",{"$f":"SUM(J13:J20)","v":0},{"$f":"SUM(K13:K19)","v":0},null,null,{"$f":"SUM(N13:N19)","v":0}]
[]
[null,"Signature du capitaine",null,null,null,null,null,"Signature du capitaine"]
[]
["Ces résultats sont à transmettre (sous 48 heures)  à Philippe LEBOURGEOIS  mail : lebourgeois.mp@gmail.com"]

{"sheet":"Match 03","index":3,"n_rows":25,"n_cols":14,"rows_kept":25,"cut":false,"hidden":false,"merged":[[24,0,24,14],[0,0,0,13],[4,4,4,6],[7,2,7,3],[7,4,7,7],[2,4,2,13],[3,0,9,1],[4,8,7,8],[4,10,4,13],[5,10,5,13],[7,10,7,13],[10,2,10,3],[10,8,10,9],[5,9,6,9],[6,10,6,13],[9,4,9,6],[10,4,10,6],[9,10,9,12],[10,10,10,12],[14,11,15,11],[14,12,15,12],[12,9,13,9],[12,10,13,10],[12,11,13,11],[12,12,13,12],[14,13,15,13],[14,0,15,0],[14,1,15,1],[14,3,15,3],[14,4,15,4],[14,5,15,5],[14,9,15,9],[14,10,15,10],[14,6,15,6],[14,7,15,7],[12,13,13,13],[12,0,13,0],[12,1,13,1],[12,3,13,3],[12,4,13,4],[12,5,13,5],[12,6,13,6],[12,7,13,7],[16,13,17,13],[16,0,17,0],[16,1,17,1],[16,3,17,3],[16,4,17,4],[16,5,17,5],[16,6,17,6],[16,7,17,7],[16,9,17,9],[16,10,17,10],[22,3,22,5],[22,7,22,8],[22,9,22,11],[18,3,19,3],[18,4,19,4],[18,13,19,13],[18,12,19,12],[18,5,19,5],[18,6,19,6],[18,0,19,0],[18,1,19,1],[22,1,22,2],[16,11,17,11],[16,12,17,12],[25,0,25,13],[18,7,19,7],[18,9,19,9],[18,10,19,10],[18,11,19,11]]}
["CHAMPIONNAT DE FRANCE   -   3 BANDES   -   EQUIPES DE CLUB"]
[]
[null,null,"Match n° 1",null,"LIGUE DE NORMANDIE DE BILLARD   -   PHASE QUALIFICATIVE"]
["w"]
[null,null,"Match n° 2",null,"Division",null,null,{"$f":"IF('Match 01'!H5<>\"\",'Match 01'!H5,\"\")","v":""},"Lieu de l'épreuve","Club",{"$f":"IF('Match 01'!K5<>\"\",'Match 01'!K5,\"\")","v":""}]
[null,null,null,null,null,null,null,null,null,"n°, rue",{"$f":"IF('Match 01'!K6<>\"\",'Match 01'!K6,\"\")","v":""}]
[null,null,null,null,null,null,null,null,null,null,{"$f":"IF('Match 01'!K7<>\"\",'Match 01'!K7,\"\")","v":""}]
[null,null,"Rencontre du :",null,{"$f":"IF('Match 01'!E8<>\"\",'Match 01'!E8,\"\")","v":""},null,null,null,null,"Code   Ville",{"$f":"IF('Match 01'!K8<>\"\",'Match 01'!K8,\"\")","v":""}]
[]
[null,null,null,null,"Nom du club",null,null,"N° équipe",null,null,"Nom du club",null,null,"N° équipe"]
[null,null,"Equipe recevante",null,null,null,null,null,"Equipe visiteuse"]
["Distance","Format du\nBillard","Nom   -   Prénom\nLicence","Points","Reprises","Série","Moyenne","Points de\nmatch","Nom   -   Prénom\nLicence","Points","Reprises","Série","Moyenne","Points de\nmatch"]
[{"$f":"IF(H5<>\"\",VLOOKUP($H$5,Données!$G$6:$K$10,2,FALSE),\"\")","v":""},null,null,null,null,null,{"$f":"IF(ISERROR(D13/E13),\"\",D13/E13)","v":""},{"$f":"IF(OR(G13=\"\",M13=\"\"),\"\",IF(D13>J13,2,IF(D13=J13,1,IF(D13<J13,0))))","v":""},null,null,{"$f":"IF(E13>0,E13,\"\")","v":""},null,{"$f":"IF(ISERROR(J13/K13),\"\",J13/K13)","v":""},{"$f":"IF(AND(H13<>\"\",J13<>\"\"),2-H13,\"\")","v":""}]
[null,null,{"$f":"IF(C13<>\"\",VLOOKUP(C13,licence,2,FALSE),\"\")","v":""},null,null,null,null,null,{"$f":"IF(I13<>\"\",VLOOKUP(I13,licence,2,FALSE),\"\")","v":""}]
[{"$f":"IF(H5<>\"\",VLOOKUP($H$5,Données!$G$6:$K$10,3,FALSE),\"\")","v":""},null,null,null,null,null,{"$f":"IF(ISERROR(D15/E15),\"\",D15/E15)","v":""},{"$f":"IF(OR(G15=\"\",M15=\"\"),\"\",IF(D15>J15,2,IF(D15=J15,1,IF(D15<J15,0))))","v":""},null,null,{"$f":"IF(E15>0,E15,\"\")","v":""},null,{"$f":"IF(ISERROR(J15/K15),\"\",J15/K15)","v":""},{"$f":"IF(AND(H15<>\"\",J15<>\"\"),2-H15,\"\")","v":""}]
[null,null,{"$f":"IF(C15<>\"\",VLOOKUP(C15,licence,2,FALSE),\"\")","v":""},null,null,null,null,null,{"$f":"IF(I15<>\"\",VLOOKUP(I15,licence,2,FALSE),\"\")","v":""}]
[{"$f":"IF(H5<>\"\",VLOOKUP($H$5,Données!$G$6:$K$10,4,FALSE),\"\")","v":""},null,null,null,null,null,{"$f":"IF(ISERROR(D17/E17),\"\",D17/E17)","v":""},{"$f":"IF(OR(G17=\"\",M17=\"\"),\"\",IF(D17>J17,2,IF(D17=J17,1,IF(D17<J17,0))))","v":""},null,null,{"$f":"IF(E17>0,E17,\"\")","v":""},null,{"$f":"IF(ISERROR(J17/K17),\"\",J17/K17)","v":""},{"$f":"IF(AND(H17<>\"\",J17<>\"\"),2-H17,\"\")","v":""}]
[null,null,{"$f":"IF(C17<>\"\",VLOOKUP(C17,licence,2,FALSE),\"\")","v":""},null,null,null,null,null,{"$f":"IF(I17<>\"\",VLOOKUP(I17,licence,2,FALSE),\"\")","v":""}]
[{"$f":"IF(H5<>\"\",VLOOKUP($H$5,Données!$G$6:$K$10,5,FALSE),\"\")","v":""},null,null,null,null,null,{"$f":"IF(ISERROR(D19/E19),\"\",D19/E19)","v":""},{"$f":"IF(OR(G19=\"\",M19=\"\"),\"\",IF(D19>J19,2,IF(D19=J19,1,IF(D19<J19,0))))","v":""},null,null,{"$f":"IF(E19>0,E19,\"\")","v":""},null,{"$f":"IF(ISERROR(J19/K19),\"\",J19/K19)","v":""},{"$f":"IF(AND(H19<>\"\",J19<>\"\"),2-H19,\"\")","v":""}]
[null,null,{"$f":"IF(C19<>\"\",VLOOKUP(C19,licence,2,FALSE),\"\")","v":""},null,null,null,null,null,{"$f":"IF(I19<>\"\",VLOOKUP(I19,licence,2,FALSE),\"\")","v":""}]
[null,null,"Totaux",{"$f":"SUM(D13:D20)","v":0},{"$f":"SUM(E13:E19)","v":0},null,null,{"$f":"SUM(H13:H19)","v":0},"Totaux",{"$f":"SUM(J13:J20)","v":0},{"$f":"SUM(K13:K19)","v":0},null,null,{"$f":"SUM(N13:N19)","v":0}]
[]
[null,"Signature du capitaine",null,null,null,null,null,"Signature du capitaine"]
[]
["Ces résultats sont à transmettre (sous 48 heures) à Philippe LEBOURGEOIS  mail : lebourgeois.mp@gmail.com"]