{"text_format":"1","workbook":"xlsx","n_sheets":7,"sheets":["données","Participants","Phase de poule","Classement","Phase finale","Feuille de match","Saisie FFB"],"not_rendered":{"charts":0,"images":0,"macros":1,"external_links":0,"defined_names":24,"comments":1,"pivot_tables":0},"unopened":[],"bounds":{"document_bytes":16777216,"sheet_cells":100000,"rows_first":2000,"rows_last":500,"rows_between":2000,"halvings":0,"cell_chars":16384,"cell_head_chars":4096},"cells_cut":0,"cells_raw":0,"read":"whole","date_system":"1900"}

{"sheet":"données","index":0,"n_rows":520,"n_cols":13,"rows_kept":520,"cut":false,"hidden":true,"merged":[[13,0,13,1],[0,9,0,13],[0,3,0,5]]}
["Mode de jeu","Catégorie","Tour","Compétiteurs",null,null,null,null,null,"Les Clubs"]
["Libre","Nationale 1","T1","Nom joueur","Club","Licence",null,"Forfait",null,"ARGENCES BILLARD CLUB             ","***","Place de la République","14370   ARGENCES"]
["Bande","Nationale 2","T2","Joueur blanc","Sans","Sans",null,null,null,"ASSUN BILLARD","Le clos Moisson","325, allée des Avoineries","50460   URVILLE - NACQUEVILLE"]
["3 bandes","Nationale 3","T3","ADNET FABRICE","BILLARD AMICAL CLUB LOVERIEN","017652Y",null,"Excusé",null,"BILLARD AMICAL CLUB LOVERIEN      ","***","3, rue Saint Jean","27400   LOUVIERS"]
["Cadre","Régionale","T4","AHAMD ABDUZALIL","BILLARD CLUB OSSELIEN","134671R",null,"Non excusé",null,"BILLARD CLUB ANDELYSIEN           ","***","3 et 5, rue Ste Clotilde","27700   LES ANDELYS"]
["4 billes","Régionale 1","T5","ALEXANDRE JACQUES","BILLARD CLUB SOTTEVILLAIS","017869H",null,null,null,"BILLARD CLUB CANY BARVILLE        ","Complexe sportif Sporticaux","Route de Veulettes","76450   CANY - BARVILLE"]
[null,"Régionale 2",null,"ALIA AHMED","BILLARD CLUB DE MAROMME","166242Y",null,null,null,"BILLARD CLUB CORMELLOIS           ","Halle des Sports","rue de la Pagnolée","14123   CORMELLES LE ROYAL"]
[null,"Régionale 3",null,"ALLART ELYSE","BILLARD CLUB DE SAINT-MARCEL","113094U",null,null,null,"BILLARD CLUB DE BERNAY","Gymnase Jacques Sébire","Chemin de la Couture","27300   BERNAY"]
[null,"Régionale 4",null,"ANDRE BERNARD","ASSUN BILLARD","140477Z",null,null,null,"BILLARD CLUB DE FECAMP            ","***","5, rue Henri Dunant","76400   FECAMP"]
[null,"Cadets",null,"ANTEM ANTOINE","BILLARD CLUB DE LA SAUSSAYE","017606E",null,null,null,"BILLARD CLUB DE LA SAUSSAYE       ","Le Mille Club","rue Lesage  - Maille","27370   LA SAUSSAYE"]
[null,"Juniors",null,"ARGENTIN JEAN LUC","BILLARD CLUB DE FECAMP","137351T",null,null,null,"BILLARD CLUB DE MAROMME","***","4, rue Jacquard","76150   MAROMME"]
[null,"Féminines",null,"ARRIVE JEAN LUC","BILLARD CLUB DE LA SAUSSAYE","100560S",null,null,null,"BILLARD CLUB DE SAINT NICOLAS     ","***","93, rue Laurent Lefèbvre","76510   SAINT NICOLAS D'ALIERMONT"]
[null,null,null,"AUBE ALAIN","BILLARD CLUB DE MAROMME","168020F",null,null,null,"BILLARD CLUB DE SAINT-MARCEL      ","Espace Saint Exupéry","2, rue Jules Ferry","27950   SAINT MARCEL"]
["Points de match",null,null,"AUBERT DANIEL","BILLARD CLUB ANDELYSIEN","131880I",null,null,null,"BILLARD CLUB EBROICIEN            ","Maison des Jeunes et de la Cullture","1, avenue Aristide Briand","27000   EVREUX"]
["Qualif","Final",null,"AUBERT JEAN PAUL","BILLARD CLUB ANDELYSIEN","129110U",null,null,null,"BILLARD CLUB GAILLONNAIS          ","Centre des Arts Contemporains","Allée de l'Ermitage","27600   GAILLON"]
{"$rows_left_out":506}
{"sheet":"Participants","index":1,"n_rows":21,"n_cols":11,"rows_kept":21,"cut":false,"hidden":false,"merged":[[1,1,1,6],[3,10,4,11],[13,10,14,11],[6,9,7,12],[8,10,8,12],[9,10,9,12],[10,10,10,12],[19,9,19,12],[20,9,20,12],[11,10,11,12],[9,9,10,9],[17,1,18,1],[17,4,18,6],[17,9,17,12],[18,9,18,12]]}
[]
[null,"LIGUE DE NORMANDIE DE BILLARD 2020-2021"]
[]
[null,"Directeur de jeu",null,"Mode de jeu","Catégorie","Tour","Distance",null,null,null,"Phase de poule"]
[]
[null,"Date de l'épreuve",null,null,"Format  billard"]
[null,null,null,null,null,null,null,null,null,"LIEU DE L'EPREUVE"]
[]
[null,null,null,"Nom et Prénom","Club d'appartenance","Licence","Points de Classement\nacquis avant ce tour",null,null,"Nom Club"]
[null,"Tête de série A1",null,null,{"$f":"IFERROR(IF(D10<>\"\",VLOOKUP(D10,info_joueur,2,FALSE),\" \"),\"\")","v":" "},{"$f":"IFERROR(IF(D10<>\"\",VLOOKUP(D10,info_joueur,3,FALSE),\" \"),\"\")","v":" "},null,null,null,"n° et rue",{"$f":"IF(K9<>\"\",VLOOKUP(K9,données!$J$2:$M$23,2,FALSE),\"\")","v":""}]
[null,"Joueur A2",null,null,{"$f":"IFERROR(IF(D11<>\"\",VLOOKUP(D11,info_joueur,2,FALSE),\" \"),\"\")","v":" "},{"$f":"IFERROR(IF(D11<>\"\",VLOOKUP(D11,info_joueur,3,FALSE),\" \"),\"\")","v":" "},null,null,null,null,{"$f":"IF(K9<>\"\",VLOOKUP(K9,données!$J$2:$M$23,3,FALSE),\"\")","v":""}]
[null,"Joueur A3",null,null,{"$f":"IFERROR(IF(D12<>\"\",VLOOKUP(D12,info_joueur,2,FALSE),\" \"),\"\")","v":" "},{"$f":"IFERROR(IF(D12<>\"\",VLOOKUP(D12,info_joueur,3,FALSE),\" \"),\"\")","v":" "},null,null,null,"CP + Ville",{"$f":"IF(K9<>\"\",VLOOKUP(K9,données!$J$2:$M$23,4,FALSE),\"\")","v":""}]
[]
[null,"Tête de série B1",null,null,{"$f":"IFERROR(IF(D14<>\"\",VLOOKUP(D14,info_joueur,2,FALSE),\" \"),\"\")","v":" "},{"$f":"IFERROR(IF(D14<>\"\",VLOOKUP(D14,info_joueur,3,FALSE),\" \"),\"\")","v":" "},null,null,null,null,"Feuille de match"]
[null,"Joueur B2",null,null,{"$f":"IFERROR(IF(D15<>\"\",VLOOKUP(D15,info_joueur,2,FALSE),\" \"),\"\")","v":" "},{"$f":"IFERROR(IF(D15<>\"\",VLOOKUP(D15,info_joueur,3,FALSE),\" \"),\"\")","v":" "}]
{"$rows_left_out":7}
{"sheet":"Phase de poule","index":2,"n_rows":19,"n_cols":17,"rows_kept":19,"cut":false,"hidden":false,"merged":[[10,14,10,15],[12,14,12,15],[8,1,9,1],[3,16,3,17],[4,16,4,18],[6,16,6,18],[6,9,6,11],[8,9,8,11],[10,9,10,11],[12,9,12,11],[7,9,7,11],[9,9,9,11],[11,9,11,11],[18,3,19,4],[18,6,19,7],[0,0,0,12],[13,0,16,0],[13,1,14,1],[15,1,16,1],[3,1,4,1],[10,1,11,1],[8,0,11,0],[3,0,6,0],[5,1,6,1],[1,8,3,12],[15,9,15,11],[13,9,13,11]]}
["Ranking   -   T6   -   Phase de Poule"]
[null,null,null,null,null,null,null,null,"ATTENTION\nSi après le premier tour, 2 joueurs sont à égalité (points, reprises et série) c'est le joueur n° 3 qui dispute le 2ème tour contre le joueur n° 1"]
["Tour","Poule","Joueur","Points","Reprises","Série","Points de match","Moyenne"]
[1,"A",{"$f":"IF(Participants!D11<>\"\",Participants!D11,\"\")","v":""},null,null,null,null,{"$f":"IFERROR(D4/E4,\"\")","v":""},null,null,null,null,null,null,null,null,"Vainqueur T1"]
[null,null,{"$f":"IF(Participants!D12<>\"\",Participants!D12,\"\")","v":""},null,{"$f":"IF(E4<>\"\",E4,\"\")","v":""},null,{"$f":"IF(G4<>\"\",2-G4,\"\")","v":""},{"$f":"IFERROR(D5/E5,\"\")","v":""},null,null,null,null,null,null,"Poule A",null,{"$f":"IF(H4>H5,C4,IF(H4=H5,IF(OR(F4>F5,F4=F5),C4,C5),C5))","v":""}]
[null,"B",{"$f":"IF(Participants!D15<>\"\",Participants!D15,\"\")","v":""},null,null,null,null,{"$f":"IFERROR(D6/E6,\"\")","v":""}]
[null,null,{"$f":"IF(Participants!D16<>\"\",Participants!D16,\"\")","v":""},null,{"$f":"IF(E6<>\"\",E6,\"\")","v":""},null,{"$f":"IF(G6<>\"\",2-G6,\"\")","v":""},{"$f":"IFERROR(D7/E7,\"\")","v":""},null,"Date",null,null,null,null,"Poule B",null,{"$f":"IF(H6>H7,C6,IF(H6=H7,IF(OR(F6>F7,F6=F7),C6,C7),C7))","v":""}]
[null,null,null,null,null,null,null,null,null,{"$f":"IF(Participants!B7<>\"\",Participants!B7,\"\")","v":""}]
[2,"A",{"$f":"IF(Q11=0,IF(Participants!D10<>\"\",Participants!D10,\"\"),\"\")","v":""},null,null,null,null,{"$f":"IFERROR(D9/E9,\"\")","v":""},null,"Catégorie",null,null,null,null,"Total"]
[null,null,{"$f":"IF(Q11=0,IF(Q5=Participants!D11,Participants!D12,Participants!D11),\"\")","v":""},null,{"$f":"IF(E9<>\"\",E9,\"\")","v":""},null,{"$f":"IF(G9<>\"\",2-G9,\"\")","v":""},{"$f":"IFERROR(D10/E10,\"\")","v":""},null,{"$f":"IF(Participants!E5<>\"\",Participants!E5,\" \")","v":" "}]
[null,"B",{"$f":"IF(Q13=0,IF(Participants!D14<>\"\",Participants!D14,\"\"),\"\")","v":""},null,null,null,null,{"$f":"IFERROR(D11/E11,\"\")","v":""},null,"Distance",null,null,null,null,"Nb_vide T1A",null,{"$f":"COUNTBLANK(D4:H5)","v":10}]
[null,null,{"$f":"IF(Q13=0,IF(Q7=Participants!D15,Participants!D16,Participants!D15),\"\")","v":""},null,{"$f":"IF(E11<>\"\",E11,\"\")","v":""},null,{"$f":"IF(G11<>\"\",2-G11,\"\")","v":""},{"$f":"IFERROR(D12/E12,\"\")","v":""},null,{"$f":"IF(Participants!G5<>\"\",Participants!G5,\" \")","v":" "}]
[null,null,null,null,null,null,null,{"$f":"IF(E13>0,D13/E13,\"\")","v":""},null,"Mode de jeu",null,null,null,null,"Nb_vide T1B",null,{"$f":"COUNTBLANK(D6:H7)","v":10}]
[3,"A",{"$f":"IF(Q11=0,IF(Participants!D10<>\"\",Participants!D10,\"\"),\"\")","v":""},null,null,null,null,{"$f":"IFERROR(D14/E14,\"\")","v":""},null,{"$f":"IF(Participants!D5<>\"\",Participants!D5,\" \")","v":" "}]
[null,null,{"$f":"IF(Q11=0,Q5,\"\")","v":""},null,{"$f":"IF(E14<>\"\",E14,\"\")","v":""},null,{"$f":"IF(G14<>\"\",2-G14,\"\")","v":""},{"$f":"IFERROR(D15/E15,\"\")","v":""}]
{"$rows_left_out":5}
{"sheet":"Classement","index":3,"n_rows":27,"n_cols":15,"rows_kept":27,"cut":false,"hidden":false,"merged":[[1,5,2,8],[15,11,15,12],[5,11,5,12],[0,11,0,12],[1,11,1,12],[2,11,2,12],[3,11,3,12],[4,11,4,13],[0,0,0,6],[3,2,3,10],[26,4,27,5],[26,7,27,8],[6,11,6,12],[7,11,7,12],[9,11,9,12],[10,11,10,12],[16,11,16,12],[20,11,20,12],[21,11,21,12],[22,11,22,12],[11,11,11,12],[14,11,14,13],[19,11,19,13],[23,11,23,12]]}
["LIGUE DE NORMANDIE DE BILLARD",null,null,null,null,null,null,null,null,null,null,"Date :",null,{"$f":"IF(Participants!B7<>\"\",Participants!B7,\"\")","v":""}]
[null,null,null,null,null,"CLASSEMENT",null,null,null,null,null,"Mode de jeu :",null,{"$f":"IF(Participants!D5<>\"\",Participants!D5,\"\")","v":""}]
[null,null,null,null,null,null,null,null,null,null,null,"Catégorie :",null,{"$f":"IF(Participants!E5<>\"\",Participants!E5,\"\")","v":""}]
[null,null,"Le classement s'effectue selon les points de match puis la moyenne, la moyenne particulière et la série si nécessaire",null,null,null,null,null,null,null,null,"Distance :",null,{"$f":"IF(Participants!G5<>\"\",Participants!G5,\"\")","v":""}]
[null,null,"Classement général par poule","points","reprises","série","moyenne particulière ","moyenne ","points de match",null,"Classement","Saisir 1, 2 ou 3 dans la colonne classement"]
[null,{"$f":"K6","v":0},{"$f":"IF(Participants!D10=\"\",\"\",Participants!D10)","v":""},{"$f":"SUM('Feuille de match'!B14:B16)","v":0},{"$f":"SUM('Feuille de match'!C14:C16)","v":0},{"$f":"MAX('Feuille de match'!D14:D16)","v":0},{"$f":"MAX('Feuille de match'!O13:Q13)","v":0},{"$f":"IF(E6>0,D6/E6,0)","v":0},{"$f":"SUM('Feuille de match'!F14:F16)","v":0},null,null,"1er",null,{"$f":"IFERROR(VLOOKUP(1,$B$6:$C$8,2,FALSE),\"\")","v":""}]
[null,{"$f":"K7","v":0},{"$f":"IF(Participants!D11=\"\",\"\",Participants!D11)","v":""},{"$f":"SUM('Feuille de match'!B30:B32)","v":0},{"$f":"SUM('Feuille de match'!C30:C32)","v":0},{"$f":"MAX('Feuille de match'!D30:D32)","v":0},{"$f":"MAX('Feuille de match'!O29:Q29)","v":0},{"$f":"IF(E7>0,D7/E7,0)","v":0},{"$f":"SUM('Feuille de match'!F30:F32)","v":0},null,null,"2ème",null,{"$f":"IFERROR(VLOOKUP(2,$B$6:$C$8,2,FALSE),\"\")","v":""}]
[null,0,{"$f":"IF(Participants!D12=\"\",\"\",Participants!D12)","v":""},{"$f":"SUM('Feuille de match'!B46:B48)","v":0},{"$f":"SUM('Feuille de match'!C46:C48)","v":0},{"$f":"MAX('Feuille de match'!D46:D48)","v":0},{"$f":"MAX('Feuille de match'!O45:Q45)","v":0},{"$f":"IF(E8>0,D8/E8,0)","v":0},{"$f":"SUM('Feuille de match'!F46:F48)","v":0},null,null,"3ème",null,{"$f":"IFERROR(VLOOKUP(3,$B$6:$C$8,2,FALSE),\"\")","v":""}]
[]
[null,0,{"$f":"IF(Participants!D14=\"\",\"\",Participants!D14)","v":""},{"$f":"SUM('Feuille de match'!I14:I16)","v":0},{"$f":"SUM('Feuille de match'!J14:J16)","v":0},{"$f":"MAX('Feuille de match'!K14:K16)","v":0},{"$f":"MAX('Feuille de match'!U13:W13)","v":0},{"$f":"IF(E10>0,D10/E10,)","v":0},{"$f":"SUM('Feuille de match'!M14:M16)","v":0},null,null,"1er",null,{"$f":"IFERROR(VLOOKUP(1,$B$10:$C$12,2,FALSE),\"\")","v":""}]
[null,0,{"$f":"IF(Participants!D15=\"\",\"\",Participants!D15)","v":""},{"$f":"SUM('Feuille de match'!I30:I32)","v":0},{"$f":"SUM('Feuille de match'!J30:J32)","v":0},{"$f":"MAX('Feuille de match'!K30:K32)","v":0},{"$f":"MAX('Feuille de match'!U29:W29)","v":0},{"$f":"IF(E11>0,D11/E11,0)","v":0},{"$f":"SUM('Feuille de match'!M30:M32)","v":0},null,null,"2ème",null,{"$f":"IFERROR(VLOOKUP(2,$B$10:$C$12,2,FALSE),\"\")","v":""}]
[null,0,{"$f":"IF(Participants!D16=\"\",\"\",Participants!D16)","v":""},{"$f":"SUM('Feuille de match'!I46:I48)","v":0},{"$f":"SUM('Feuille de match'!J46:J48)","v":0},{"$f":"MAX('Feuille de match'!K46:K48)","v":0},{"$f":"MAX('Feuille de match'!U45:W45)","v":0},{"$f":"IF(E12>0,D12/E12,0)","v":0},{"$f":"SUM('Feuille de match'!M46:M48)","v":0},null,null,"3ème",null,{"$f":"IFERROR(VLOOKUP(3,$B$10:$C$12,2,FALSE),\"\")","v":""}]
[]
[]
[null,null,"Classement des vainqueurs de poule",null,null,null,null,null,null,null,null,"Saisir 1 ou 2 dans la colonne classement"]
{"$rows_left_out":13}
{"sheet":"Phase finale","index":4,"n_rows":16,"n_cols":12,"rows_kept":16,"cut":false,"hidden":false,"merged":[[0,0,0,13],[3,1,4,1],[5,1,6,1],[8,10,8,12],[3,0,6,0],[4,10,4,12],[5,10,5,12],[15,4,16,5],[15,7,16,8],[7,10,7,12],[10,10,10,12],[2,0,2,1],[12,1,13,1],[8,1,9,1],[11,10,11,12],[10,1,11,1],[8,0,13,0],[13,10,13,12],[6,10,6,12],[9,10,9,12]]}
["Ranking   -   T6   -   Phase finale"]
[]
[null,null,"Joueur",null,"Points","Reprises","Série","Points de match","Moyenne"]
["1/2 finales","A",{"$f":"Classement!N16","v":""},{"$f":"C5","v":""},null,null,null,null,{"$f":"IFERROR(E4/F4,\"\")","v":""}]
[null,null,{"$f":"Classement!N22","v":""},{"$f":"C4","v":""},null,{"$f":"IF(F4<>\"\",F4,\"\")","v":""},null,{"$f":"IF(H4<>\"\",2-H4,\"\")","v":""},{"$f":"IFERROR(E5/F5,\"\")","v":""},null,"Date"]
[null,"B",{"$f":"Classement!N17","v":""},{"$f":"C7","v":""},null,null,null,null,{"$f":"IFERROR(E6/F6,\"\")","v":""},null,{"$f":"IF(Participants!B7<>\"\",Participants!B7,\"\")","v":""}]
[null,null,{"$f":"Classement!N21","v":""},{"$f":"C6","v":""},null,{"$f":"IF(F6<>\"\",F6,\"\")","v":""},null,{"$f":"IF(H6<>\"\",2-H6,\"\")","v":""},{"$f":"IFERROR(E7/F7,\"\")","v":""},null,"Catégorie"]
[null,null,null,null,null,null,null,null,null,null,{"$f":"IF(Participants!E5<>\"\",Participants!E5,\" \")","v":" "}]
["Places","1 / 2",{"$f":"IF(AND(H4<>\"\",H5<>\"\"),IF(H4>H5,C4,C5),\"\")","v":""},{"$f":"C10","v":""},null,null,null,null,{"$f":"IFERROR(E9/F9,\"\")","v":""},null,"Distance"]
[null,null,{"$f":"IF(AND(H6<>\"\",H7<>\"\"),IF(H6>H7,C6,C7),\"\")","v":""},{"$f":"C9","v":""},null,{"$f":"IF(F9<>\"\",F9,\"\")","v":""},null,{"$f":"IF(H9<>\"\",2-H9,\"\")","v":""},"",null,{"$f":"IF(Participants!G5<>\"\",Participants!G5,\" \")","v":" "}]
[null,"3 / 4",{"$f":"IF(AND(H4<>\"\",H5<>\"\"),IF(H4>H5,C5,C4),\"\")","v":""},{"$f":"C12","v":""},null,null,null,null,"",null,"Mode de jeu"]
[null,null,{"$f":"IF(AND(H6<>\"\",H7<>\"\"),IF(H6<H7,C6,C7),\"\")","v":""},{"$f":"C11","v":""},null,{"$f":"IF(F11<>\"\",F11,\"\")","v":""},null,{"$f":"IF(H11<>\"\",2-H11,\"\")","v":""},"",null,{"$f":"IF(Participants!D5<>\"\",Participants!D5,\" \")","v":" "}]
[null,"5 / 6",{"$f":"Classement!N23","v":""},{"$f":"C14","v":""},null,null,null,null,""]
[null,null,{"$f":"Classement!N24","v":""},{"$f":"C13","v":""},null,{"$f":"IF(F13<>\"\",F13,\"\")","v":""},null,{"$f":"IF(H13<>\"\",2-H13,\"\")","v":""},"",null,"Points de match"]
[null,null,null,null,null,null,null,null,null,null,"Gagné","=  2 points"]
{"$rows_left_out":2}
{"sheet":"Feuille de match","index":5,"n_rows":64,"n_cols":25,"rows_kept":64,"cut":false,"hidden":false,"merged":[[11,20,11,24],[11,14,11,18],[10,2,10,5],[10,9,10,12],[7,8,7,12],[7,1,7,5],[0,0,0,12],[1,0,1,12],[42,2,42,5],[42,9,42,12],[5,8,5,12],[11,2,11,5],[5,1,5,5],[6,1,6,5],[3,1,3,5],[3,8,3,10],[4,8,4,12],[11,9,11,12],[27,9,27,12],[26,2,26,5],[26,9,26,12],[27,2,27,5],[21,2,21,4],[21,9,21,11],[27,14,27,18],[43,14,43,18],[27,20,27,24],[43,20,43,24],[43,2,43,5],[43,9,43,12],[37,2,37,4],[37,9,37,11],[53,2,53,4],[53,9,53,11],[63,0,63,3],[59,15,59,17],[58,0,58,4],[59,0,59,3],[60,0,60,3],[61,0,61,3],[62,0,62,3],[53,15,53,17],[54,15,54,17],[55,15,55,17],[58,8,58,12],[56,15,56,17],[57,15,57,17],[58,15,58,17]]}
["Fédération Française de Billard"]
["Ligue de Normandie   -   Tournoi qualificatif pour la finale de Ligue"]
[]
["Lieu de l'épreuve :",{"$f":"IF(Participants!K9<>\"\",Participants!K9,\" \")","v":" "},null,null,null,null,null,"Mode de jeu :",{"$f":"IF(Participants!D5=\"\",\"\",Participants!D5)","v":""},null,null,"Tour :",{"$f":"IF(Participants!F5=\"\",\"\",Participants!F5)","v":""}]
[null,null,null,null,null,null,null,"Catégorie :",{"$f":"IF(Participants!E5=\"\",\"\",Participants!E5)","v":""}]
[null,{"$f":"IF(Participants!K10<>\"\",Participants!K10,\" \")","v":" "},null,null,null,null,null,"Distance :",{"$f":"IF(Participants!G5=\"\",\"\",Participants!G5)","v":""},null,null,null,null,null,"Places 1 à 6 - Cases vides",null,null,{"$f":"COUNTBLANK(phase_finale)","v":6}]
[null,{"$f":"IF(Participants!K11<>\"\",Participants!K11,\" \")","v":" "}]
[null,{"$f":"IF(Participants!K12<>\"\",Participants!K12,\" \")","v":" "},null,null,null,null,null,"Date de l'épreuve :",{"$f":"IF(Participants!B7<>\"\",Participants!B7,\" \")","v":" "}]
[]
[]
["Tête de série  A",null,{"$f":"IF(Participants!D10=\"\",\"\",Participants!D10)","v":""},null,null,null,null,"Tête de série  B",null,{"$f":"IF(Participants!D14=\"\",\"\",Participants!D14)","v":""}]
[{"$f":"IF(Participants!F10=\"\",\"\",Participants!F10)","v":" "},"Club :",{"$f":"IF(Participants!E10=\"\",\"\",Participants!E10)","v":" "},null,null,null,null,{"$f":"IF(Participants!F14=\"\",\"\",Participants!F14)","v":" "},"Club :",{"$f":"IF(Participants!E14=\"\",\"\",Participants!E14)","v":" "},null,null,null,null,{"$f":"C11","v":""},null,null,null,null,null,{"$f":"J11","v":""}]
[null,"Points","Reprises","Série","Moyenne","Points de\nmatch",null,null,"Points","Reprises","Série","Moyenne","Points de\nmatch",null,{"$f":"IF(F14>1,E14,0)","v":0},{"$f":"IF(F15>1,E15,0)","v":0},{"$f":"IF(F16>1,E16,0)","v":0},{"$f":"IF(F17>1,E17,0)","v":0},{"$f":"IF(F18>1,E18,0)","v":0},null,{"$f":"IF(M14>1,L14,0)","v":0},{"$f":"IF(M15>1,L15,0)","v":0},{"$f":"IF(M16>1,L16,0)","v":0},{"$f":"IF(M17>1,L17,0)","v":0},{"$f":"IF(M18>1,L18,0)","v":0}]
[{"$f":"IF(C11='Phase de poule'!C4,'Phase de poule'!C5,      IF(C11='Phase de poule'!C5,'Phase de poule'!C4,\" \"))","v":""},{"$f":"IFERROR(VLOOKUP(C11,poule_a_t_1,2,FALSE),\"\")","v":0},{"$f":"IFERROR(VLOOKUP(C11,poule_a_t_1,3,FALSE),\"\")","v":0},{"$f":"IFERROR(VLOOKUP(C11,poule_a_t_1,4,FALSE),\"\")","v":0},{"$f":"IFERROR(VLOOKUP(C11,poule_a_t_1,6,FALSE),\"\")","v":""},{"$f":"IFERROR(VLOOKUP(C11,poule_a_t_1,5,FALSE),\"\")","v":0},null,{"$f":"IF(J11='Phase de poule'!C6,'Phase de poule'!C7,      IF(J11='Phase de poule'!C7,'Phase de poule'!C6,\" \"))","v":""},{"$f":"IFERROR(VLOOKUP(J11,poule_b_t_1,2,FALSE),\"\")","v":0},{"$f":"IFERROR(VLOOKUP(J11,poule_b_t_1,3,FALSE),\"\")","v":0},{"$f":"IFERROR(VLOOKUP(J11,poule_b_t_1,4,FALSE),\"\")","v":0},{"$f":"IFERROR(VLOOKUP(J11,poule_b_t_1,6,FALSE),\"\")","v":""},{"$f":"IFERROR(VLOOKUP(J11,poule_b_t_1,5,FALSE),\"\")","v":0}]
[{"$f":"IF(C11='Phase de poule'!C9,'Phase de poule'!C10,      IF(C11='Phase de poule'!C9,'Phase de poule'!C10,\" \"))","v":""},{"$f":"IFERROR(VLOOKUP(C11,poule_a_t_2,2,FALSE),\"\")","v":0},{"$f":"IFERROR(VLOOKUP(C11,poule_a_t_2,3,FALSE),\"\")","v":0},{"$f":"IFERROR(VLOOKUP(C11,poule_a_t_2,4,FALSE),\"\")","v":0},{"$f":"IFERROR(VLOOKUP(C11,poule_a_t_2,6,FALSE),\"\")","v":""},{"$f":"IFERROR(VLOOKUP(C11,poule_a_t_2,5,FALSE),\"\")","v":0},null,{"$f":"IF(J11='Phase de poule'!C11,'Phase de poule'!C12,      IF(J11='Phase de poule'!C12,'Phase de poule'!C11,\" \"))","v":""},{"$f":"IFERROR(VLOOKUP(J11,poule_b_t_2,2,FALSE),\"\")","v":0},{"$f":"IFERROR(VLOOKUP(J11,poule_b_t_2,3,FALSE),\"\")","v":0},{"$f":"IFERROR(VLOOKUP(J11,poule_b_t_2,4,FALSE),\"\")","v":0},{"$f":"IFERROR(VLOOKUP(J11,poule_b_t_2,6,FALSE),\"\")","v":""},{"$f":"IFERROR(VLOOKUP(J11,poule_b_t_2,5,FALSE),\"\")","v":0}]
{"$rows_left_out":50}
{"sheet":"Saisie FFB","index":6,"n_rows":22,"n_cols":13,"rows_kept":22,"cut":false,"hidden":false,"merged":[[4,1,4,2],[4,3,4,7],[9,1,9,6],[9,7,9,12],[5,1,5,2],[5,3,5,7],[6,1,6,2],[6,3,6,7],[7,1,7,2],[7,3,7,7],[0,0,0,12],[2,1,2,2],[2,3,2,7],[3,1,3,2],[3,3,3,7]]}
["Tableau d'aide à la saisie des résultats sur les sites FFB"]
["Compétition"]
[null,"Lieu :   ",null,{"$f":"Participants!K9","v":0}]
[null,"Date :   ",null,{"$f":"Participants!B7","v":"00:00:00"}]
[null,"Mode de jeu :   ",null,{"$f":"Participants!D5","v":0}]
[null,"Catégorie :   ",null,{"$f":"Participants!E5","v":0}]
[null,"Tour :   ",null,{"$f":"Participants!F5","v":0}]
[null,"Format billard :   ",null,{"$f":"Participants!E7","v":0}]
[]
[null,"Joueur 1",null,null,null,null,null,"Joueur 2"]
["N° match","Nom","Licence","Points","Reprises","Série","Points de\nmatch","Nom","Licence","Points","Reprises","Série","Points de\nmatch"]
[1,{"$f":"'Phase de poule'!C4","v":""},{"$f":"IFERROR(VLOOKUP(B12,info_joueur,3,FALSE),\"\")","v":""},{"$f":"IF('Phase de poule'!D4<>\"\",'Phase de poule'!D4,\"\")","v":""},{"$f":"IF('Phase de poule'!E4<>\"\",'Phase de poule'!E4,\"\")","v":""},{"$f":"IF('Phase de poule'!F4<>\"\",'Phase de poule'!F4,\"\")","v":""},{"$f":"IF('Phase de poule'!G4<>\"\",'Phase de poule'!G4,\"\")","v":""},{"$f":"'Phase de poule'!C5","v":""},{"$f":"IFERROR(VLOOKUP(H12,info_joueur,3,FALSE),\"\")","v":""},{"$f":"IF('Phase de poule'!D5<>\"\",'Phase de poule'!D5,\"\")","v":""},{"$f":"IF('Phase de poule'!E5<>\"\",'Phase de poule'!E5,\"\")","v":""},{"$f":"IF('Phase de poule'!F5<>\"\",'Phase de poule'!F5,\"\")","v":""},{"$f":"IF('Phase de poule'!G5<>\"\",'Phase de poule'!G5,\"\")","v":""}]
[2,{"$f":"'Phase de poule'!C6","v":""},"",{"$f":"IF('Phase de poule'!D6<>\"\",'Phase de poule'!D6,\"\")","v":""},{"$f":"IF('Phase de poule'!E6<>\"\",'Phase de poule'!E6,\"\")","v":""},{"$f":"IF('Phase de poule'!F6<>\"\",'Phase de poule'!F6,\"\")","v":""},{"$f":"IF('Phase de poule'!G6<>\"\",'Phase de poule'!G6,\"\")","v":""},{"$f":"'Phase de poule'!C7","v":""},"",{"$f":"IF('Phase de poule'!D7<>\"\",'Phase de poule'!D7,\"\")","v":""},{"$f":"IF('Phase de poule'!E7<>\"\",'Phase de poule'!E7,\"\")","v":""},{"$f":"IF('Phase de poule'!F7<>\"\",'Phase de poule'!F7,\"\")","v":""},{"$f":"IF('Phase de poule'!G7<>\"\",'Phase de poule'!G7,\"\")","v":""}]
[3,{"$f":"'Phase de poule'!C9","v":""},"",{"$f":"IF('Phase de poule'!D9<>\"\",'Phase de poule'!D9,\"\")","v":""},{"$f":"IF('Phase de poule'!E9<>\"\",'Phase de poule'!E9,\"\")","v":""},{"$f":"IF('Phase de poule'!F9<>\"\",'Phase de poule'!F9,\"\")","v":""},{"$f":"IF('Phase de poule'!G9<>\"\",'Phase de poule'!G9,\"\")","v":""},{"$f":"'Phase de poule'!C10","v":""},"",{"$f":"IF('Phase de poule'!D10<>\"\",'Phase de poule'!D10,\"\")","v":""},{"$f":"IF('Phase de poule'!E10<>\"\",'Phase de poule'!E10,\"\")","v":""},{"$f":"IF('Phase de poule'!F10<>\"\",'Phase de poule'!F10,\"\")","v":""},{"$f":"IF('Phase de poule'!G10<>\"\",'Phase de poule'!G10,\"\")","v":""}]
[4,{"$f":"'Phase de poule'!C11","v":""},"",{"$f":"IF('Phase de poule'!D11<>\"\",'Phase de poule'!D11,\"\")","v":""},{"$f":"IF('Phase de poule'!E11<>\"\",'Phase de poule'!E11,\"\")","v":""},{"$f":"IF('Phase de poule'!F11<>\"\",'Phase de poule'!F11,\"\")","v":""},{"$f":"IF('Phase de poule'!G11<>\"\",'Phase de poule'!G11,\"\")","v":""},{"$f":"'Phase de poule'!C12","v":""},"",{"$f":"IF('Phase de poule'!D12<>\"\",'Phase de poule'!D12,\"\")","v":""},{"$f":"IF('Phase de poule'!E12<>\"\",'Phase de poule'!E12,\"\")","v":""},{"$f":"IF('Phase de poule'!F12<>\"\",'Phase de poule'!F12,\"\")","v":""},{"$f":"IF('Phase de poule'!G12<>\"\",'Phase de poule'!G12,\"\")","v":""}]
{"$rows_left_out":7}